MacBook Pro 12 erreurs hardware sur mon mac après réparation

beegeezzz

Membre confirmé
17 Janvier 2013
484
6
45
Bruxelles
Bonjour,
Il y a deux semaines, mon macbook pro retina mid-2012 démarrait mais une fois sur deux avec un écran noir.

Un magasin (belge et officiel Apple) a fait un devis en m'indiquant qu'il fallait changer la carte mère.

Un réparateur pro que je connais avait fait un test de mon mac avant réparation, il y avait deux erreurs.

Aujourd'hui, après réparation, il a refait ce test, j'en suis à 12 erreurs.

Je voulais savoir si quelqu'un avait des connaissances par rapport à la lecture des logs ASD et si vous pouviez mi'ndiquer si ce sont des faux positifis et si je dois rentrer à nouveau la machine pour garantie de réparation (payé plus de 800 EUR pour changement de la carte mère avec 3 mois de garanties).

Voici le log (uniquement les erreurs) :

[11/25/17 06:52:38] Current (ID0R) -- DC In (test #1) - Sensor Reads Within Operating Range - Check to ensure that sensor reads within operating range.

[06:52:38] ERROR -- 3 [Sensor reading below low point] -- TEST FAILED


[11/25/17 07:03:16] Video Controller Internal (test #2) - OpenGL Point Test - Render Points

[07:03:17] ERROR - 80000003 [Unsupported] -- TEST FAILED

[11/25/17 07:03:17] Video Controller Internal (test #2) - OpenGL Point Test - Render Points

[07:03:24] Test Passed

[11/25/17 07:03:24] Video Controller Internal (test #3) - OpenGL Line Test - Render Lines

[07:03:24] ERROR - 80000003 [Unsupported] -- TEST FAILED

[11/25/17 07:03:24] Video Controller Internal (test #3) - OpenGL Line Test - Render Lines

[07:03:31] Test Passed

[11/25/17 07:03:31] Video Controller Internal (test #4) - OpenGL Triangle Test - Render Triangles

[07:03:31] ERROR - 80000003 [Unsupported] -- TEST FAILED

[11/25/17 07:03:31] Video Controller Internal (test #4) - OpenGL Triangle Test - Render Triangles

[07:03:38] Test Passed

[11/25/17 07:03:38] Video Controller Internal (test #5) - OpenGL Quad Test - Render Quads

[07:03:38] ERROR - 80000003 [Unsupported] -- TEST FAILED

[11/25/17 07:03:38] Video Controller Internal (test #5) - OpenGL Quad Test - Render Quads

[07:03:45] Test Passed

[11/25/17 07:03:45] Video Controller Internal (test #7) - OpenGL Rectangle Test - Render Rectangles

[07:03:45] ERROR - 80000003 [Unsupported] -- TEST FAILED

[11/25/17 07:03:45] Video Controller Internal (test #7) - OpenGL Rectangle Test - Render Rectangles

[07:03:56] Test Passed

[11/25/17 07:03:56] Video Controller Internal (test #8) - OpenGL Cube Test - Render Cubes

[07:03:57] ERROR - 80000003 [Unsupported] -- TEST FAILED

[11/25/17 07:03:57] Video Controller Internal (test #8) - OpenGL Cube Test

- Render Cubes

[07:04:03] Test Passed

[11/25/17 07:04:03] Video Controller Internal (test #9) - OpenGL Cube with Fog Test - Render Cube with Fog

[07:04:04] ERROR - 80000003 [Unsupported] -- TEST FAILED

[11/25/17 07:04:04] Video Controller Internal (test #9) - OpenGL Cube with Fog Test - Render Cube with Fog

[07:04:11] Test Passed

[11/25/17 07:04:11] Video Controller Internal (test #10) - OpenGL Wireframe Model Test - Render Wireframe Model

[07:04:11] ERROR - 80000003 [Unsupported] -- TEST FAILED

[11/25/17 07:04:11] Video Controller Internal (test #10) - OpenGL Wireframe Model Test - Render Wireframe Model

[07:04:21] Test Passed

[11/25/17 07:04:21] Video Controller Internal (test #11) - OpenGL Solid Red Model Test - Render Solid Red Model

[07:04:22] ERROR - 80000003 [Unsupported] -- TEST FAILED

[11/25/17 07:04:22] Video Controller Internal (test #11) - OpenGL Solid Red Model Test - Render Solid Red Model

[07:04:29] Test Passed

[11/25/17 07:04:29] Video Controller Internal (test #12) - OpenGL Solid Red Model with Fog Test - Render Solid Red Model with Fog

[07:04:29] ERROR - 80000003 [Unsupported] -- TEST FAILED

[11/25/17 07:04:29] Video Controller Internal (test #12) - OpenGL Solid Red Model with Fog Test - Render Solid Red Model with Fog

[07:04:36] Test Passed

[11/25/17 07:04:36] Video Controller Internal (test #70) - Fragment Instruction Test
- Tests each instruction of the ARB fragment program instruction by doing calculation and

comparing actual against expected

[07:04:37] ERROR - 80000003 [Unsupported] -- TEST FAILED


Merci pour l'aide.
 

beegeezzz

Membre confirmé
17 Janvier 2013
484
6
45
Bruxelles
oui en effet, mais je ne rentrais plus dans les conditions...

Au fait, quand on change la carte mère, normal que le numéro de série soit toujours le même ?

Merci pour l'aide.
 

beegeezzz

Membre confirmé
17 Janvier 2013
484
6
45
Bruxelles
Salut,
Merci pour ta réponse.
Je n'étais plus dans les conditions...

Ma carte mère a été changée, mais est-ce normal que le numéro de série soit toujours identique à l'ancienne carte-mère ?

Merci pour l'aide.
 

Ma Dalton

Membre d’élite
4 Avril 2015
1 284
269
64
Tu as beaucoup de tests "Failed", le premier concerne l'alimentation (DC in), les autres la vidéo.
Il faut que tu fasses tester la machine à nouveau par le magasin Apple.

Oui il est normal d'avoir le même N° de série après le remplacement de la carte mère.
La neuve n'a pas de N° de série, après sa pose on démarre l'ordi sur une clé USB portant le logiciel "Blank Board Serializer", et on attribue le N° de série antérieur à la nouvelle carte mère.